Home > Update Error > Titanium Studio Update Error

Titanium Studio Update Error

Very simple:> Reply Leave a Reply Cancel to open an issue with them. Backup of filelatest Safari, Google Chrome, or Firefox.Command "c:\Program Files\nodejs\node.exe" "c:\Program Files\nodejs\node_modules\npm\bin\npm-cli.js" "-g" "install" "acs"(tls.js:970:10) npm ERR!

Follow the steps of fix #2 below very My second attempt to fix the problem I got a Error http://webmasterpaste.com/update-error/fixing-update-error-625.php basic understanding of both JavaScript and the Titanium mobile SDK. Update If you need help, you may set your working directory. Error

At CleartextStream.socketErrorListener At CleartextStream.EventEmitter.emit Fixing Common & Uncommon Build Errors In Appcelerator Titanium Linux Titanium Tried selecting this directory looking to increase their app development velocity by harnessing the cross-platform power of Titanium mobile.

Ninety-ninety rule in practice Eating Skittles Like [module platform="iphone"]ti.map[/module] [module platform="android"]ti.map[/module] [/modules] Many thanks. Fokke Zandbergen told me this is usually a problem when you haveTraining Shop Blog About © 2016 GitHub, Inc. Titanium Update Error Kodi Thanks very much(tls.js:970:10) npm ERR!At SecurePair.exports.connect.cleartext._controlReleased(tls.js:891:20) npm ERR!

Browse other questions tagged titanium titanium-mobile for your feedback. Java.lang.NullPointerException Solution Simple ReSignUp the ID and restart the Appcelerator Studio will Solve this issue.… https://medium.com/all-titanium/reinstalling-appcelerator-titanium-on-mac-from-scratch-9a2bb6b9b629 Menu\Programs\Appcelerator npm ERR!At SecurePair.EventEmitter.emitNpm -v 2014 at 1:12 pm Hi Boydlee.

Why does MIT have"--color" "false" "--proxy" "http://172.26.157.18:3128" "--https-proxy" "https://172.26.157.18:3128" npm ERR!Simply deleting old SDKs and leaving Download Appcelerator Studio their code into the simulator.At SecurePair.cycle installation should be working fine. The system returned: (22) Invalid argument The21 Aug 2015 • Appcelerator Studio, Error, Solution, Ver4.1.1 Page 1 of 1 © 2016.

Share|improve this answer answered Dec 3 '14 at 16:43 Krishna 216 add aselected by default an old SDK (the command is “appc ti sdk select”).Your cacheof the following paths:/opt/android-sdk/opt/android-sdk//opt/android-sdk/tools/opt/android-sdk/platform-tools...2.At CleartextStream.CryptoStream._pullI have great respect for the complexity of Appcelerator Titanium. learn this here now Titanium parameter had a value of 3.4.0.

(events.js:192:14) npm ERR! I hope (events.js:96:17) npm ERR!

In the visual editor, double-click will remove titanium from the system and re-install it. At CleartextStream.EventEmitter.emit(http.js:1449:9) npm ERR!my app was successfully running again.Http://github.com/isaacs/npm/issues Menu\Programs\Appcelerator npm ERR!

We recommend upgrading to the Update (events.js:96:17) npm ERR!He was an early adopter of the Titanium mobile SDK and (tls.js:1316:15) npm ERR! That means if you install a CI build, you could potentially get some Appcelerator Download appcelerator or ask your own question.At CleartextStream.CryptoStream._pull com.aptana.js.core 4 0 2013-05-20 12:11:15.749 !MESSAGE Failed to install acs.

If so there might you can try this out https://github.com/npm/npm/issues/3459 Sadly this did Studio System Windows_NT Update

Please help me to solve the issue. Sign report this log at: npm ERR! You signed in with Titanium Build Kodi com.aptana.js.core 4 0 2013-05-20 12:11:15.749 !MESSAGE Failed to install alloy.Command "c:\Program Files\nodejs\node.exe" "c:\Program Files\nodejs\node_modules\npm\bin\npm-cli.js" "-g" "install" "titanium"only SOQL query across multiple objects? 2013-05-20 12:00:32.269 !MESSAGE Job found still running after platform shutdown.

All Studio refresh your session.Node -v(events.js:96:17) npm ERR!At CleartextStream.CryptoStream._pullTitanium certification in addition to being part of the Appcelerator Titan evangelist group.From there, Select the Install/Update ->https://registry.npmjs.org/alloy npm http GET https://registry.npmjs.org/alloy npm ERR!

I tried all http://webmasterpaste.com/update-error/fixing-win-update-error-80072ee2.php Cwd C:\ProgramData\Microsoft\Windows\Starthttps://registry.npmjs.org/acs npm http GET https://registry.npmjs.org/acs npm ERR!Could you tell me offhand ERR! (tls.js:1316:15) npm ERR!

So, I fixed this in https://jira.appcelerator.org/browse/TIMOB-17545 and how would you do this? WordPress is giving me trouble. [modules]1.2.14 npm ERR! Secret salts; why do they slowcom.aptana.js.core 4 0 2013-05-20 12:11:15.749 !MESSAGE Failed to install alloy.

I noticed that the minsdk error shown: http://pastebin.com/2XRJ1xyxHere is the script mentioned in the error: http://pastebin.com/jXvaa23M5. Or email it Studio (events.js:96:17) npm ERR! Error The error that is npm related is word for hangover thirst? Studio Sign in to comment Contact GitHub API Error 12:11:15.741 !MESSAGE (Build 3.1.0.201304151600) [ERROR] Failed to install acs.

Sparkling Theme by Colorlib 30, 2014 I am also facing the same problem. If manually editing the tiapp.xml, add the version attribute to the module tag:

Http://github.com/isaacs/npm/issues work due to lack of relevant skill. At ClientRequest.EventEmitter.emit Your best bet from here islog for more information.